{"text_format":"1","workbook":"xlsx","n_sheets":11,"sheets":["FORM","Spotters","Sheet2","NOTES","Sheet1","Sheet5","Callups","Events","Instructions","Summary","Sheet3"],"not_rendered":{"charts":0,"images":0,"macros":1,"external_links":0,"defined_names":9,"comments":0,"pivot_tables":0},"unopened":[],"bounds":{"document_bytes":16777216,"sheet_cells":100000,"rows_first":2000,"rows_last":500,"rows_between":2000,"halvings":0,"cell_chars":16384,"cell_head_chars":4096},"cells_cut":0,"cells_raw":0,"read":"whole","date_system":"1900"}

{"sheet":"FORM","index":0,"n_rows":153,"n_cols":11,"rows_kept":153,"cut":false,"hidden":false,"merged":[[23,6,23,9],[22,6,22,9],[17,6,17,9],[18,6,18,9],[19,6,19,9],[20,6,20,9],[21,6,21,9],[0,0,0,3],[0,6,0,7],[12,6,12,9],[3,6,3,9],[1,1,1,2],[16,6,16,9],[10,6,10,9],[7,6,7,9],[11,6,11,9],[4,6,4,9],[6,6,6,9],[9,6,9,9],[15,6,15,9],[14,6,14,9],[13,6,13,9],[8,6,8,9]]}
["Washington- Greene County Emergency Log  v7.1.0.1",null,null,null,"Type","Summer","Total Operator Hours",null,{"$f":"I3*J3","v":0}]
["Call","Criteria",null,"Storm Watch","Date",{"$f":"TODAY()","v":"2021-08-13"},"Start 24 hr Time","End 24hr Time","Total","Checkins"]
["NR","Call","Name","H/M","Avail Y/N","Location",null,null,{"$f":"INT(K3)*24+HOUR(K3)+ROUND(MINUTE(K3)/60,2)","v":0},{"$f":"COUNTA(B4:B153)","v":0},{"$f":"IF((H3-G3)<0,1-(G3-H3),(H3-G3))","v":0}]
[1,null,"Net Control",null,null,{"$f":"IF(D4=\"H\",(IFERROR(VLOOKUP(B4,Spotters!$A$1:$C$498,3,FALSE),\" \")),\" \")","v":" "},"Notes and Links"]
[2,null,"Assistant Net Control",null,null,{"$f":"IF(D5=\"H\",(IFERROR(VLOOKUP(B5,Spotters!$A$1:$C$498,3,FALSE),\" \")),\" \")","v":" "},"Click arrow beside Type to select. Shaded cells can not be"]
[3,null,"NWS Reporter",null,null,{"$f":"IF(D6=\"H\",(IFERROR(VLOOKUP(B6,Spotters!$A$1:$C$498,3,FALSE),\" \")),\" \")","v":" "},"edited. Notes are added on the NOTES sheet (bottom of form)"]
[4,null,{"$f":"IFERROR(VLOOKUP(B7,Spotters!$A$1:$C$498,2,FALSE),\" \")","v":" "},null,null,{"$f":"IF(D7=\"H\",(IFERROR(VLOOKUP(B7,Spotters!$A$1:$C$498,3,FALSE),\" \")),\" \")","v":" "},"National Weather Phone # 412-262-1988 - Public Machine"]
[5,null,{"$f":"IFERROR(VLOOKUP(B8,Spotters!$A$1:$C$498,2,FALSE),\" \")","v":" "},null,null,{"$f":"IF(D8=\"H\",(IFERROR(VLOOKUP(B8,Spotters!$A$1:$C$498,3,FALSE),\" \")),\" \")","v":" "},"800-242-0510 - or 412-262-0510 - Trained Spotters ONLY"]
[6,null,{"$f":"IFERROR(VLOOKUP(B9,Spotters!$A$1:$C$498,2,FALSE),\" \")","v":" "},null,null,{"$f":"IF(D9=\"H\",(IFERROR(VLOOKUP(B9,Spotters!$A$1:$C$498,3,FALSE),\" \")),\" \")","v":" "},"Press Control Q to sort the Spotter's call signs"]
[7,null,{"$f":"IFERROR(VLOOKUP(B10,Spotters!$A$1:$C$498,2,FALSE),\" \")","v":" "},null,null,{"$f":"IF(D10=\"H\",(IFERROR(VLOOKUP(B10,Spotters!$A$1:$C$498,3,FALSE),\" \")),\" \")","v":" "},"Pittsburgh Weather Radar"]
[8,null,{"$f":"IFERROR(VLOOKUP(B11,Spotters!$A$1:$C$498,2,FALSE),\" \")","v":" "},null,null,{"$f":"IF(D11=\"H\",(IFERROR(VLOOKUP(B11,Spotters!$A$1:$C$498,3,FALSE),\" \")),\" \")","v":" "},"Net Call-up"]
[9,null,{"$f":"IFERROR(VLOOKUP(B12,Spotters!$A$1:$C$498,2,FALSE),\" \")","v":" "},null,null,{"$f":"IF(D12=\"H\",(IFERROR(VLOOKUP(B12,Spotters!$A$1:$C$498,3,FALSE),\" \")),\" \")","v":" "},"Public Service Call Up"]
[10,null,{"$f":"IFERROR(VLOOKUP(B13,Spotters!$A$1:$C$498,2,FALSE),\" \")","v":" "},null,null,{"$f":"IF(D13=\"H\",(IFERROR(VLOOKUP(B13,Spotters!$A$1:$C$498,3,FALSE),\" \")),\" \")","v":" "},"Net Closing"]
[11,null,{"$f":"IFERROR(VLOOKUP(B14,Spotters!$A$1:$C$498,2,FALSE),\" \")","v":" "},null,null,{"$f":"IF(D14=\"H\",(IFERROR(VLOOKUP(B14,Spotters!$A$1:$C$498,3,FALSE),\" \")),\" \")","v":" "},"Check For New Check-ins"]
[12,null,{"$f":"IFERROR(VLOOKUP(B15,Spotters!$A$1:$C$498,2,FALSE),\" \")","v":" "},null,null,{"$f":"IF(D15=\"H\",(IFERROR(VLOOKUP(B15,Spotters!$A$1:$C$498,3,FALSE),\" \")),\" \")","v":" "},"Add/Edit Spotters"]
[13,null,{"$f":"IFERROR(VLOOKUP(B16,Spotters!$A$1:$C$498,2,FALSE),\" \")","v":" "},null,null,{"$f":"IF(D16=\"H\",(IFERROR(VLOOKUP(B16,Spotters!$A$1:$C$498,3,FALSE),\" \")),\" \")","v":" "},"Skywarn Information Sheet"]
[14,null,{"$f":"IFERROR(VLOOKUP(B17,Spotters!$A$1:$C$498,2,FALSE),\" \")","v":" "},null,null,{"$f":"IF(D17=\"H\",(IFERROR(VLOOKUP(B17,Spotters!$A$1:$C$498,3,FALSE),\" \")),\" \")","v":" "},"Summer Reporting Criteria"]
[15,null,{"$f":"IFERROR(VLOOKUP(B18,Spotters!$A$1:$C$498,2,FALSE),\" \")","v":" "},null,null,{"$f":"IF(D18=\"H\",(IFERROR(VLOOKUP(B18,Spotters!$A$1:$C$498,3,FALSE),\" \")),\" \")","v":" "},"Winter Reporting Criteria"]
[16,null,{"$f":"IFERROR(VLOOKUP(B19,Spotters!$A$1:$C$498,2,FALSE),\" \")","v":" "},null,null,{"$f":"IF(D19=\"H\",(IFERROR(VLOOKUP(B19,Spotters!$A$1:$C$498,3,FALSE),\" \")),\" \")","v":" "},"Condition Green - All Watches and Statements"]
[17,null,{"$f":"IFERROR(VLOOKUP(B20,Spotters!$A$1:$C$498,2,FALSE),\" \")","v":" "},null,null,{"$f":"IF(D20=\"H\",(IFERROR(VLOOKUP(B20,Spotters!$A$1:$C$498,3,FALSE),\" \")),\" \")","v":" "},"Condition Yellow - Thunderstorm and Flash Flood Warning"]
[18,null,{"$f":"IFERROR(VLOOKUP(B21,Spotters!$A$1:$C$498,2,FALSE),\" \")","v":" "},null,null,{"$f":"IF(D21=\"H\",(IFERROR(VLOOKUP(B21,Spotters!$A$1:$C$498,3,FALSE),\" \")),\" \")","v":" "},"Condition Red - Tornado Warning"]
[19,null,{"$f":"IFERROR(VLOOKUP(B22,Spotters!$A$1:$C$498,2,FALSE),\" \")","v":" "},null,null,{"$f":"IF(D22=\"H\",(IFERROR(VLOOKUP(B22,Spotters!$A$1:$C$498,3,FALSE),\" \")),\" \")","v":" "},"Email This Log To:"]
[20,null,{"$f":"IFERROR(VLOOKUP(B23,Spotters!$A$1:$C$498,2,FALSE),\" \")","v":" "},null,null,{"$f":"IF(D23=\"H\",(IFERROR(VLOOKUP(B23,Spotters!$A$1:$C$498,3,FALSE),\" \")),\" \")","v":" "},"Storm Reprt Form"]
[21,null,{"$f":"IFERROR(VLOOKUP(B24,Spotters!$A$1:$C$498,2,FALSE),\" \")","v":" "},null,null,{"$f":"IF(D24=\"H\",(IFERROR(VLOOKUP(B24,Spotters!$A$1:$C$498,3,FALSE),\" \")),\" \")","v":" "}]
[22,null,{"$f":"IFERROR(VLOOKUP(B25,Spotters!$A$1:$C$498,2,FALSE),\" \")","v":" "},null,null,{"$f":"IF(D25=\"H\",(IFERROR(VLOOKUP(B25,Spotters!$A$1:$C$498,3,FALSE),\" \")),\" \")","v":" "}]
[23,null,{"$f":"IFERROR(VLOOKUP(B26,Spotters!$A$1:$C$498,2,FALSE),\" \")","v":" "},null,null,{"$f":"IF(D26=\"H\",(IFERROR(VLOOKUP(B26,Spotters!$A$1:$C$498,3,FALSE),\" \")),\" \")","v":" "}]
[24,null,{"$f":"IFERROR(VLOOKUP(B27,Spotters!$A$1:$C$498,2,FALSE),\" \")","v":" "},null,null,{"$f":"IF(D27=\"H\",(IFERROR(VLOOKUP(B27,Spotters!$A$1:$C$498,3,FALSE),\" \")),\" \")","v":" "}]
[25,null,{"$f":"IFERROR(VLOOKUP(B28,Spotters!$A$1:$C$498,2,FALSE),\" \")","v":" "},null,null,{"$f":"IF(D28=\"H\",(IFERROR(VLOOKUP(B28,Spotters!$A$1:$C$498,3,FALSE),\" \")),\" \")","v":" "}]
[26,null,{"$f":"IFERROR(VLOOKUP(B29,Spotters!$A$1:$C$498,2,FALSE),\" \")","v":" "},null,null,{"$f":"IF(D29=\"H\",(IFERROR(VLOOKUP(B29,Spotters!$A$1:$C$498,3,FALSE),\" \")),\" \")","v":" "}]
[27,null,{"$f":"IFERROR(VLOOKUP(B30,Spotters!$A$1:$C$498,2,FALSE),\" \")","v":" "},null,null,{"$f":"IF(D30=\"H\",(IFERROR(VLOOKUP(B30,Spotters!$A$1:$C$498,3,FALSE),\" \")),\" \")","v":" "}]
[28,null,{"$f":"IFERROR(VLOOKUP(B31,Spotters!$A$1:$C$498,2,FALSE),\" \")","v":" "},null,null,{"$f":"IF(D31=\"H\",(IFERROR(VLOOKUP(B31,Spotters!$A$1:$C$498,3,FALSE),\" \")),\" \")","v":" "}]
[29,null,{"$f":"IFERROR(VLOOKUP(B32,Spotters!$A$1:$C$498,2,FALSE),\" \")","v":" "},null,null,{"$f":"IF(D32=\"H\",(IFERROR(VLOOKUP(B32,Spotters!$A$1:$C$498,3,FALSE),\" \")),\" \")","v":" "}]
[30,null,{"$f":"IFERROR(VLOOKUP(B33,Spotters!$A$1:$C$498,2,FALSE),\" \")","v":" "},null,null,{"$f":"IF(D33=\"H\",(IFERROR(VLOOKUP(B33,Spotters!$A$1:$C$498,3,FALSE),\" \")),\" \")","v":" "}]
[31,null,{"$f":"IFERROR(VLOOKUP(B34,Spotters!$A$1:$C$498,2,FALSE),\" \")","v":" "},null,null,{"$f":"IF(D34=\"H\",(IFERROR(VLOOKUP(B34,Spotters!$A$1:$C$498,3,FALSE),\" \")),\" \")","v":" "}]
[32,null,{"$f":"IFERROR(VLOOKUP(B35,Spotters!$A$1:$C$498,2,FALSE),\" \")","v":" "},null,null,{"$f":"IF(D35=\"H\",(IFERROR(VLOOKUP(B35,Spotters!$A$1:$C$498,3,FALSE),\" \")),\" \")","v":" "}]
[33,null,{"$f":"IFERROR(VLOOKUP(B36,Spotters!$A$1:$C$498,2,FALSE),\" \")","v":" "},null,null,{"$f":"IF(D36=\"H\",(IFERROR(VLOOKUP(B36,Spotters!$A$1:$C$498,3,FALSE),\" \")),\" \")","v":" "}]
[34,null,{"$f":"IFERROR(VLOOKUP(B37,Spotters!$A$1:$C$498,2,FALSE),\" \")","v":" "},null,null,{"$f":"IF(D37=\"H\",(IFERROR(VLOOKUP(B37,Spotters!$A$1:$C$498,3,FALSE),\" \")),\" \")","v":" "}]
[35,null,{"$f":"IFERROR(VLOOKUP(B38,Spotters!$A$1:$C$498,2,FALSE),\" \")","v":" "},null,null,{"$f":"IF(D38=\"H\",(IFERROR(VLOOKUP(B38,Spotters!$A$1:$C$498,3,FALSE),\" \")),\" \")","v":" "}]
[36,null,{"$f":"IFERROR(VLOOKUP(B39,Spotters!$A$1:$C$498,2,FALSE),\" \")","v":" "},null,null,{"$f":"IF(D39=\"H\",(IFERROR(VLOOKUP(B39,Spotters!$A$1:$C$498,3,FALSE),\" \")),\" \")","v":" "}]
[37,null,{"$f":"IFERROR(VLOOKUP(B40,Spotters!$A$1:$C$498,2,FALSE),\" \")","v":" "},null,null,{"$f":"IF(D40=\"H\",(IFERROR(VLOOKUP(B40,Spotters!$A$1:$C$498,3,FALSE),\" \")),\" \")","v":" "}]
[38,null,{"$f":"IFERROR(VLOOKUP(B41,Spotters!$A$1:$C$498,2,FALSE),\" \")","v":" "},null,null,{"$f":"IF(D41=\"H\",(IFERROR(VLOOKUP(B41,Spotters!$A$1:$C$498,3,FALSE),\" \")),\" \")","v":" "}]
[39,null,{"$f":"IFERROR(VLOOKUP(B42,Spotters!$A$1:$C$498,2,FALSE),\" \")","v":" "},null,null,{"$f":"IF(D42=\"H\",(IFERROR(VLOOKUP(B42,Spotters!$A$1:$C$498,3,FALSE),\" \")),\" \")","v":" "}]
[40,null,{"$f":"IFERROR(VLOOKUP(B43,Spotters!$A$1:$C$498,2,FALSE),\" \")","v":" "},null,null,{"$f":"IF(D43=\"H\",(IFERROR(VLOOKUP(B43,Spotters!$A$1:$C$498,3,FALSE),\" \")),\" \")","v":" "}]
[{"$f":"A43+1","v":41},null,{"$f":"IFERROR(VLOOKUP(B44,Spotters!$A$1:$C$498,2,FALSE),\" \")","v":" "},null,null,{"$f":"IF(D44=\"H\",(IFERROR(VLOOKUP(B44,Spotters!$A$1:$C$498,3,FALSE),\" \")),\" \")","v":" "}]
[{"$f":"A44+1","v":42},null,{"$f":"IFERROR(VLOOKUP(B45,Spotters!$A$1:$C$498,2,FALSE),\" \")","v":" "},null,null,{"$f":"IF(D45=\"H\",(IFERROR(VLOOKUP(B45,Spotters!$A$1:$C$498,3,FALSE),\" \")),\" \")","v":" "}]
[{"$f":"A45+1","v":43},null,{"$f":"IFERROR(VLOOKUP(B46,Spotters!$A$1:$C$498,2,FALSE),\" \")","v":" "},null,null,{"$f":"IF(D46=\"H\",(IFERROR(VLOOKUP(B46,Spotters!$A$1:$C$498,3,FALSE),\" \")),\" \")","v":" "}]
[44,null,{"$f":"IFERROR(VLOOKUP(B47,Spotters!$A$1:$C$498,2,FALSE),\" \")","v":" "},null,null,{"$f":"IF(D47=\"H\",(IFERROR(VLOOKUP(B47,Spotters!$A$1:$C$498,3,FALSE),\" \")),\" \")","v":" "}]
[45,null,{"$f":"IFERROR(VLOOKUP(B48,Spotters!$A$1:$C$498,2,FALSE),\" \")","v":" "},null,null,{"$f":"IF(D48=\"H\",(IFERROR(VLOOKUP(B48,Spotters!$A$1:$C$498,3,FALSE),\" \")),\" \")","v":" "}]
[46,null,{"$f":"IFERROR(VLOOKUP(B49,Spotters!$A$1:$C$498,2,FALSE),\" \")","v":" "},null,null,{"$f":"IF(D49=\"H\",(IFERROR(VLOOKUP(B49,Spotters!$A$1:$C$498,3,FALSE),\" \")),\" \")","v":" "}]
[47,null,{"$f":"IFERROR(VLOOKUP(B50,Spotters!$A$1:$C$498,2,FALSE),\" \")","v":" "},null,null,{"$f":"IF(D50=\"H\",(IFERROR(VLOOKUP(B50,Spotters!$A$1:$C$498,3,FALSE),\" \")),\" \")","v":" "}]
[48,null,{"$f":"IFERROR(VLOOKUP(B51,Spotters!$A$1:$C$498,2,FALSE),\" \")","v":" "},null,null,{"$f":"IF(D51=\"H\",(IFERROR(VLOOKUP(B51,Spotters!$A$1:$C$498,3,FALSE),\" \")),\" \")","v":" "}]
[49,null,{"$f":"IFERROR(VLOOKUP(B52,Spotters!$A$1:$C$498,2,FALSE),\" \")","v":" "},null,null,{"$f":"IF(D52=\"H\",(IFERROR(VLOOKUP(B52,Spotters!$A$1:$C$498,3,FALSE),\" \")),\" \")","v":" "}]
[50,null,{"$f":"IFERROR(VLOOKUP(B53,Spotters!$A$1:$C$498,2,FALSE),\" \")","v":" "},null,null,{"$f":"IF(D53=\"H\",(IFERROR(VLOOKUP(B53,Spotters!$A$1:$C$498,3,FALSE),\" \")),\" \")","v":" "}]
[51,null,{"$f":"IFERROR(VLOOKUP(B54,Spotters!$A$1:$C$498,2,FALSE),\" \")","v":" "},null,null,{"$f":"IF(D54=\"H\",(IFERROR(VLOOKUP(B54,Spotters!$A$1:$C$498,3,FALSE),\" \")),\" \")","v":" "}]
[52,null,{"$f":"IFERROR(VLOOKUP(B55,Spotters!$A$1:$C$498,2,FALSE),\" \")","v":" "},null,null,{"$f":"IF(D55=\"H\",(IFERROR(VLOOKUP(B55,Spotters!$A$1:$C$498,3,FALSE),\" \")),\" \")","v":" "}]
[53,null,{"$f":"IFERROR(VLOOKUP(B56,Spotters!$A$1:$C$498,2,FALSE),\" \")","v":" "},null,null,{"$f":"IF(D56=\"H\",(IFERROR(VLOOKUP(B56,Spotters!$A$1:$C$498,3,FALSE),\" \")),\" \")","v":" "}]
[54,null,{"$f":"IFERROR(VLOOKUP(B57,Spotters!$A$1:$C$498,2,FALSE),\" \")","v":" "},null,null,{"$f":"IF(D57=\"H\",(IFERROR(VLOOKUP(B57,Spotters!$A$1:$C$498,3,FALSE),\" \")),\" \")","v":" "}]
[55,null,{"$f":"IFERROR(VLOOKUP(B58,Spotters!$A$1:$C$498,2,FALSE),\" \")","v":" "},null,null,{"$f":"IF(D58=\"H\",(IFERROR(VLOOKUP(B58,Spotters!$A$1:$C$498,3,FALSE),\" \")),\" \")","v":" "}]
[56,null,{"$f":"IFERROR(VLOOKUP(B59,Spotters!$A$1:$C$498,2,FALSE),\" \")","v":" "},null,null,{"$f":"IF(D59=\"H\",(IFERROR(VLOOKUP(B59,Spotters!$A$1:$C$498,3,FALSE),\" \")),\" \")","v":" "}]
[57,null,{"$f":"IFERROR(VLOOKUP(B60,Spotters!$A$1:$C$498,2,FALSE),\" \")","v":" "},null,null,{"$f":"IF(D60=\"H\",(IFERROR(VLOOKUP(B60,Spotters!$A$1:$C$498,3,FALSE),\" \")),\" \")","v":" "}]
{"$rows_left_out":94}
{"sheet":"Spotters","index":1,"n_rows":239,"n_cols":3,"rows_kept":239,"cut":false,"hidden":false,"merged":[]}
["AA3KC","STEPHEN","DILLINER "]
["AB1A","MIKE","SOUTH STRABANE"]
["AB3KE","JASON","BOBTOWN "]
["K3AJC","ANTHONY","MCDONALD"]
["K3CRJ","CHRIS","SLIPPERY Rock"]
["K3KFO","DAVID","FINLEYVILLE"]
["K3OXG","LOUIS","WAYNESBURG "]
["K3PSP","DENNIS","WASHINGTON"]
["K3SAT","PAUL","DAWSONVILLE, GA"]
["K3SEM","STEPHEN","HICKORY"]
["K6RBV","MICHAEL","WINTERSVILLE, OH"]
["K8TBS","ALLEN","CANTON, OH"]
["K8YBS","ALLEN","ST CLAIRSVILLE, OH"]
["KA3CDW","JAMES","GRAYSVILLE"]
["KA3ETC","MICHAEL","GREENSBORO"]
["KA3FFF","CLIFFORD","MOUNT MORRIS "]
["KA3KSP","JIM","CARNEGI"]
["KA3OKW","LILLIAN","WIND RIDGE"]
["KA3OKX","SHAWN","WIND RIDGE"]
["KA3OKY","SHANE","WIND RIDGE"]
["KA3OLA","MIKE","CARMICHAELS"]
["KA3OLF","TERRY","WIND RIDGE "]
["KA3PMW","DAVID","MATHER"]
["KA3SQE","SUSAN","SPRAGGS "]
["KB3CDN","FRANCIS","ROGERSVILLE"]
["KB3COQ","GEORGETTA","GREENSBORO "]
["KB3COR","JERRY","WAYNESBURG "]
["KB3CUP","ELZA","GREENSBORO "]
["KB3CYX","SFRANK","CLARKSVILLE"]
["KB3DFV","RALPH","WAYNESBURG "]
["KB3DHZ","JOSEPH","MOUNT MORRIS"]
["KB3DUV","ROGER","HOLBROOK"]
["KB3EGC","RICHARD","CARMICHEALS"]
["KB3IN","BOB","WASHINGTON"]
["KB3IVK","STEPHEN","WAYNESBURG"]
["KB3KFT","JOHN","WAYNESBURG"]
["KB3LIX","BILL","WASHINGTON"]
["KB3LYB","MARK","PITTSBURGH"]
["KB3MHG","DAVID","RICES LANDING"]
["KB3OMR","ERIC","WAYNESBURG"]
["KB3OXH","BILL","NEW MANCHESTER WV"]
["KB3PAT","MICHAEL","BOILING SPRINGS"]
["KB3RDN","TIM","CHARMICHAELS"]
["KB3REN","TIMOTHY","CARMICHAELS"]
["KB3SLN","JAMES","GREENSBORO "]
["KB3TFN","PATRICK","SOUTH STRABANE"]
["KB3WBX","JEFFREY","HOLBROOK"]
["KB3WBY","JOSEPH","WAYNESBURG"]
["KB3YRU","EDDIE","PERRYOPOLIS"]
["KB3ZUS","ROBERT","CANONSBURG"]
["KC3AAZ","BILL","PROSPERITY"]
["KC3ABB","RYAN","WASHINGTON"]
["KC3ABC","RONALD","BENTLEYVILLE"]
["KC3ABD","MIKE","MONONGAHELA"]
["KC3ABE","JONATHAN","FINLEYVILLE"]
["KC3AFS","DALE","LEWISBURG"]
["KC3AJM","ROBERT","CLAYSVILLE"]
["KC3AJN","WOODY","CONWAY"]
["KC3ANX","TIMOTHY","FINLEYVILLE"]
["KC3APY","DANIEL","EIGHTY FOUR"]
{"$rows_left_out":180}
{"sheet":"Sheet2","index":2,"n_rows":15,"n_cols":5,"rows_kept":15,"cut":false,"hidden":true,"merged":[]}
["Alert","FLOOD WARNING","BLIZZARD ADVISORY","Amber","COUNTY"]
["Drill","FLOOD WATCH","BLOWING SNOW","Civil Danger","FEMA"]
["PubSvc","FOG Advisory","FOG Advisory","Civil Emergency","PEMA"]
["Summer","HEAT Advisory","FREEZING RAIN","Evac Immediate","SET"]
["Winter","Special Advisory","Hazz.  Wx Outlook","Hazardous"]
[null,"Stand By","HIGH WIND WARNING","Law Enforcement"]
[null,"Storm Warning","ICE Advisory","Local Emergency"]
[null,"Storm Watch","SNOW ADVISORY","Nuclear Power"]
[null,"Tornado Warning","Stand By","Phone Outage"]
[null,"TORNADO WATCH","WIND ADVISORY","Radiological Hazard"]
[null,"WIND Advisory","WIND CHILL ADVISORY"]
[null,null,"WIND CHILL WARNING"]
[null,null,"WINTER STORM WATCH"]
[null,null,"WINTER WARNING"]
[null,null,"WINTER WX ADVISORY"]

{"sheet":"NOTES","index":3,"n_rows":0,"n_cols":0,"rows_kept":0,"cut":false,"hidden":false,"merged":[[1,0,1,21],[2,0,2,21],[3,0,3,21],[4,0,4,21],[5,0,5,21],[6,0,6,21],[7,0,7,21],[8,0,8,21],[9,0,9,21],[10,0,10,21],[11,0,11,21],[12,0,12,21],[13,0,13,21],[14,0,14,21],[15,0,15,21],[16,0,16,21],[17,0,17,21],[18,0,18,21],[19,0,19,21],[20,0,20,21],[22,0,22,21],[23,0,23,21],[24,0,24,21],[36,0,36,21],[25,0,25,21],[26,0,26,21],[27,0,27,21],[28,0,28,21],[29,0,29,21],[30,0,30,21],[31,0,31,21],[32,0,32,21],[33,0,33,21],[34,0,34,21],[35,0,35,21],[0,0,0,21],[49,0,49,21],[50,0,50,21],[43,0,43,21],[44,0,44,21],[45,0,45,21],[46,0,46,21],[47,0,47,21],[48,0,48,21],[37,0,37,21],[38,0,38,21],[39,0,39,21],[40,0,40,21],[41,0,41,21],[42,0,42,21],[21,0,21,21]]}

{"sheet":"Sheet1","index":4,"n_rows":0,"n_cols":0,"rows_kept":0,"cut":false,"hidden":true,"merged":[]}

{"sheet":"Sheet5","index":5,"n_rows":40,"n_cols":1,"rows_kept":40,"cut":false,"hidden":true,"merged":[]}
["Tornados, Funnel clouds, or rotating wall clouds. Hail any size (give compared to US coins) Wind gust in excess of 50 mph and means of measurement. Flooding of streams, creeks or rivers out of their banks. Roads or streets made impassable due to water. Rain 1 inch or more an hour measured in rain gauge, Any damage by wind or lightning. Downed trees or power lines. Do NOT give fair weather reports. Please give Time of occurrence, Event (Hail, Tornado, Funnel Cloud, etc.)  Location, county and direction/distance from nearest town"]
[]
[]
["Back"]
[]
[]
[]
[]
["Winter criteria for Skywarn net reporting"]
[]
["Snow accumulation in inches (When (new) snow accumulation reaches 2 inches Then at 4 inches, 6, 9, 12, etc) inches, and every 3 inches thereafter , Give a final report/total at the end of the storm, Thunder Snow - time and location. Any ice accumulation on trees, streets, or  power lines, accumulation of 1/4' or more. Sleet or freezing rain. Wind gusts in excess of 35 MPH and means of measurement. Impassable or closed roads, Downed Trees, large branches or power lines. Ant other storm damage. Time of event, Event, location - County and direction/distance from nearest  town."]
[]
["  "]
["Back"]
[]
[]
[]
[]
[]
[]
[]
[]
[]
[]
[]
[]
[]
["Meghan Aleret"]
[]
["Information on a missing child.   Refer to your Email from INWS and copy the information in it to the NOTES tab at the bottom of this form."]
[]
[]
[]
[]
[]
[]
[]
["ALL Drills"]
[]
["Be sure that any and all communications you have say \"This is a drill this is a drill\" then state what kind of drill (ex: Plane crash at the airport.)  Place the details in the NOTES tab at the bottom of this form."]

{"sheet":"Callups","index":6,"n_rows":16,"n_cols":5,"rows_kept":16,"cut":false,"hidden":false,"merged":[[5,0,6,6],[11,0,11,5],[12,0,12,5],[13,0,13,2],[9,0,9,5],[10,0,10,5],[0,0,0,6],[1,1,1,6],[2,0,2,1],[2,4,2,5],[3,0,4,5]]}
["Calling the Washington and Greene County Skywarn Net Calling the Washington and Greene County Skywarn Net . This is"]
[{"$f":"FORM!B4","v":0},"net control. This is a directed net. This net has been activated by the National Weather Service for a"]
["Severe Weather Watch",null,"until",{"$f":"FORM!H3","v":"00:00:00"}]
["The National Weather Service Will be looking for:"]
[]
["reports of Hail, Wind Damage, Lightning, Flooding of creeks and streams or Rain in excess of 1 inch per hour."]
[]
[]
[]
["When checking into the net please give your Call sign phonetically and then give your name, location, availability."]
["If you are mobile, give your location and direction of travel. Please notify net control before leaving the net."]
["We will now take check-ins from any station with emergency or priority traffic -- we will now take check-ins from stations on portable or"]
["from stations on portable or emergency power -- we will now take check-ins from stations on Echolink -- we will"]
["will now take check-ins from any station please call",null,null,{"$f":"FORM!B4","v":0},"net control."]
[]
[null,null,null,"Back to top"]

{"sheet":"Events","index":7,"n_rows":8,"n_cols":1,"rows_kept":8,"cut":false,"hidden":false,"merged":[]}
["10K"]
["15K"]
["20K"]
["5K"]
["Canoe Race"]
["Run for Alex"]
["Tri Athalon"]
["Washington Laborday Race"]

{"sheet":"Instructions","index":8,"n_rows":458,"n_cols":7,"rows_kept":458,"cut":false,"hidden":false,"merged":[[139,0,139,6],[85,0,85,6],[86,0,86,6],[82,0,82,6],[409,0,409,5],[425,0,425,6],[426,0,426,6],[428,0,428,5],[429,0,429,5],[419,0,419,6],[420,2,420,4],[420,5,420,6],[422,0,422,6],[423,0,423,6],[424,0,424,6],[413,0,413,5],[87,0,87,6],[88,0,88,6],[89,0,89,6],[90,0,90,6],[91,0,91,6],[283,0,283,6],[284,0,284,6],[285,0,285,6],[410,0,410,5],[411,0,411,2],[399,0,399,6],[400,2,400,4],[400,5,400,6],[402,0,402,6],[403,0,403,6],[404,0,404,6],[405,0,405,6],[406,0,406,6],[408,0,408,5],[401,2,401,3],[0,2,0,6],[1,0,1,6],[2,0,2,6],[16,0,16,6],[83,0,83,6],[84,0,84,6],[52,0,52,5],[48,0,48,1],[41,0,41,1],[41,2,41,3],[5,2,5,6],[6,0,6,4],[7,1,7,6],[13,0,13,5],[40,0,40,7],[44,2,44,6],[49,0,49,1],[46,0,47,6],[45,0,45,6],[50,0,50,6],[49,2,49,7],[51,1,51,3],[121,0,121,6],[41,5,41,6],[79,0,79,6],[81,0,81,6],[48,3,48,5],[134,0,135,5],[94,0,94,6],[118,0,118,6],[120,0,120,6],[119,0,119,6],[92,0,92,6],[43,0,43,1],[42,3,42,4],[93,0,93,6],[372,0,372,6],[373,0,373,6],[374,0,374,6],[361,0,361,6],[366,0,366,6],[367,0,367,6],[142,0,142,6],[187,0,188,5],[240,0,240,5],[279,0,279,6],[280,0,280,6],[368,0,368,6],[369,0,369,6],[370,0,370,6],[371,0,371,6],[355,0,358,6],[359,0,360,6],[362,0,363,6],[364,0,365,6],[282,0,282,6],[281,0,281,6],[286,0,286,6],[288,0,288,6],[462,0,462,6],[454,0,454,6],[455,0,455,6],[457,0,457,5],[458,0,458,6],[449,0,449,6],[450,0,450,6],[451,0,451,6],[452,0,452,6],[453,0,453,6],[456,0,456,6],[459,0,459,6],[460,0,460,6],[461,0,461,6]]}
["This is ",{"$f":"FORM!B4","v":0},"net control for the Washington and Greene County Skywarn/Emergency/Public Service"]
["net. Anyone wishing to check-in to the net please call net control."]
[]
[null,null,null,"or"]
[]
["This is ",{"$f":"FORM!B4","v":0},"net control for the Washington and Greene County Skywarn/Emergency/Public Service"]
["Net. this is a directed net and has been called by the Nationak Weather Service for a",null,null,null,null,{"$f":"FORM!D2","v":"Storm Watch"},"until"]
[{"$f":"FORM!H3","v":"00:00:00"},"local time. Anyone wishing to check-in to the net please call net control."]
[]
[]
[]
[]
[]
[]
[]
[]
["Back to top"]
[]
[]
[]
[]
[]
[]
[]
[]
[]
[]
[]
[]
[]
[]
[]
[]
[]
[]
[]
[]
[]
[]
[]
["This has been the Washington and Greene County Skywarn/Public Service net. We will be closing the net at this time because the because"]
[{"$f":"FORM!D2","v":"Storm Watch"},null,"has expired as of ",null,{"$f":"FORM!H3","v":"00:00:00"},"local time "]
["There were",{"$f":"FORM!J3","v":0},"checkins","Total event time was",null,{"$f":"FORM!I3","v":0},"hours."]
["Total operator time was",null,{"$f":"FORM!I1","v":0},"hours","This is",{"$f":"FORM!B4","v":0},"Closing"]
["the net at ",{"$f":"NOW()","v":44421.70501273148},"local time and turning the frequency back to general amature use. Please continue"]
["to monitor this frequency incase we are called up again. We would like to thank all those who checked in and those who"]
["gave us a clear frequency to operate on. "]
[]
[]
["Be sure to email this sheet to: ",null,"brad_m1@verizon.net -  bud@n3tir.com - tom.pghmtb@gmail.com"]
[]
[]
["Back to top"]
[]
[]
[]
[]
[]
[]
[]
{"$rows_left_out":399}
{"sheet":"Summary","index":9,"n_rows":153,"n_cols":6,"rows_kept":153,"cut":false,"hidden":false,"merged":[[13,4,13,7],[0,0,0,5],[3,4,3,7],[4,4,4,7],[5,4,5,7],[6,4,6,7],[7,4,7,7],[8,4,8,7],[9,4,9,7],[10,4,10,7],[11,4,11,7],[12,4,12,7],[20,4,20,7],[21,4,21,7],[22,4,22,7],[14,4,14,7],[15,4,15,7],[16,4,16,7],[17,4,17,7],[18,4,18,7],[19,4,19,7]]}
["Washington & Greene County Log Summary  v2.0"]
[null,"Summary for: ","Event","Storm Watch","Total Checkins",0]
["NR","Call","Total Event Time",0,"Total Operator Hours",0]
[1,null,"Date","2021-08-13"]
[2]
[3]
[4]
[5]
[6]
[7]
[8]
[9]
[10]
[11]
[12]
[13]
[14]
[15]
[16]
[17]
[18]
[19]
[20]
[21]
[22]
[23]
[24]
[25]
[26]
[27]
[28]
[29]
[30]
[31]
[32]
[33]
[34]
[35]
[36]
[37]
[38]
[39]
[40]
[{"$f":"A43+1","v":41}]
[{"$f":"A44+1","v":42}]
[{"$f":"A45+1","v":43}]
[44]
[45]
[46]
[47]
[48]
[49]
[50]
[51]
[52]
[53]
[54]
[55]
[56]
[57]
{"$rows_left_out":94}
{"sheet":"Sheet3","index":10,"n_rows":0,"n_cols":0,"rows_kept":0,"cut":false,"hidden":true,"merged":[]}